{"text_format":"1","workbook":"xlsx","n_sheets":13,"sheets":["Eingaben","Resultat","Benutzerannahmen","Hilfe","Nutzungsbedingungen","Konstanten Motoren","Kosten","Referenzanlagen","BerechnungenAnlagen ","InitialwerteSteuerelemente","Sprachen1","Sprachen2","Sprachen3"],"not_rendered":{"charts":2,"images":16,"macros":1,"external_links":0,"defined_names":10,"comments":5,"pivot_tables":0},"unopened":[],"bounds":{"document_bytes":16777216,"sheet_cells":100000,"rows_first":2000,"rows_last":500,"rows_between":2000,"halvings":0,"cell_chars":16384,"cell_head_chars":4096},"cells_cut":0,"cells_raw":0,"read":"whole","date_system":"1900"}

{"sheet":"Eingaben","index":0,"n_rows":68,"n_cols":6,"rows_kept":68,"cut":false,"hidden":false,"merged":[]}
[]
[null,{"$f":"CHOOSE($F$4,Sprachen1!B4,Sprachen1!C4,Sprachen1!D4,Sprachen1!E4)","v":"SOTEA"},{"$f":"CHOOSE($F$4,Sprachen1!B5,Sprachen1!C5,Sprachen1!D5,Sprachen1!E5)","v":"Software Tool des Effizienzpotenzials bei elektrischen Antrieben"}]
[null,{"$f":"CHOOSE($F$4,Sprachen1!B6,Sprachen1!C6,Sprachen1!D6,Sprachen1!E6)","v":"Allgemein"}]
[null,null,{"$f":"CHOOSE($F$4,Sprachen1!B7,Sprachen1!C7,Sprachen1!D7,Sprachen1!E7)","v":"deutsch/français/english/中文"},null,null,1]
[]
[null,null,{"$f":"CHOOSE($F$4,Sprachen1!B60,Sprachen1!C60,Sprachen1!D60,Sprachen1!E60)","v":"Währung"},null,null,"EUR"]
[]
[null,null,{"$f":"CHOOSE($F$4,Sprachen1!B8,Sprachen1!C8,Sprachen1!D8,Sprachen1!E8)","v":"Datum"},null,null,0.82]
[]
[null,null,{"$f":"CHOOSE($F$4,Sprachen1!B9,Sprachen1!C9,Sprachen1!D9,Sprachen1!E9)","v":"Firma"}]
{"$rows_left_out":59}
{"sheet":"Resultat","index":1,"n_rows":66,"n_cols":6,"rows_kept":66,"cut":false,"hidden":true,"merged":[]}
[null,{"$f":"CHOOSE($F$4,Sprachen2!B4,Sprachen2!C4,Sprachen2!D4,Sprachen2!E4)","v":"SOTEA Resultat"}]
[]
[null,{"$f":"CHOOSE($F$4,Sprachen2!B5,Sprachen2!C5,Sprachen2!D5,Sprachen2!E5)","v":"Eingabe-Protokoll"}]
[null,null,null,null,null,1]
[null,{"$f":"CHOOSE($F$4,Sprachen2!B6,Sprachen2!C6,Sprachen2!D6,Sprachen2!E6)","v":"Allgemein"}]
[null,{"$f":"CHOOSE($F$4,Sprachen2!B7,Sprachen2!C7,Sprachen2!D7,Sprachen2!E7)","v":"Datum"},null,null,null,"EUR"]
[null,{"$f":"CHOOSE($F$4,Sprachen2!B8,Sprachen2!C8,Sprachen2!D8,Sprachen2!E8)","v":"Firma"}]
[null,{"$f":"CHOOSE($F$4,Sprachen2!B9,Sprachen2!C9,Sprachen2!D9,Sprachen2!E9)","v":"Objekt"}]
[null,{"$f":"CHOOSE($F$4,Sprachen2!B10,Sprachen2!C10,Sprachen2!D10,Sprachen2!E10)","v":"Lieferndes EW"}]
[null,{"$f":"CHOOSE($F$4,Sprachen2!B11,Sprachen2!C11,Sprachen2!D11,Sprachen2!E11)","v":"PLZ und Ort"}]
{"$rows_left_out":57}
{"sheet":"Benutzerannahmen","index":2,"n_rows":62,"n_cols":6,"rows_kept":62,"cut":false,"hidden":false,"merged":[]}
[{"$f":"CHOOSE($F$18,Sprachen3!B4,Sprachen3!C4,Sprachen3!D4,Sprachen3!E4)","v":"Benutzerannahmen"}]
[]
[{"$f":"CHOOSE($F$18,Sprachen3!B164,Sprachen3!C164,Sprachen3!D164,Sprachen3!E164)","v":"Währungen"}]
[null,null,null,null,null,2]
[{"$f":"CHOOSE($F$18,Sprachen3!B165,Sprachen3!C165,Sprachen3!D165,Sprachen3!E165)","v":"Währung  (ISO-Code)"},{"$f":"CHOOSE($F$18,Sprachen3!B166,Sprachen3!C166,Sprachen3!D166,Sprachen3!E166)","v":"Wechselkurs gegenüber CHF"}]
["CHF",1]
["EUR",0.82]
["USD",1.1399999999999999]
["JPY",116.5]
["CNY",7.12]
{"$rows_left_out":53}
{"sheet":"Hilfe","index":3,"n_rows":37,"n_cols":6,"rows_kept":37,"cut":false,"hidden":false,"merged":[]}
[{"$f":"CHOOSE($F$4,Sprachen3!B43,Sprachen3!C43,Sprachen3!D43,Sprachen3!E43)","v":"Hilfe"}]
[]
[{"$f":"CHOOSE($F$4,Sprachen3!B44,Sprachen3!C44,Sprachen3!D44,Sprachen3!E44)","v":"Übersicht und Berechnungsgrundlagen"}]
[null,null,null,null,null,1]
[{"$f":"CHOOSE($F$4,Sprachen3!B45,Sprachen3!C45,Sprachen3!D45,Sprachen3!E45)","v":"Mit dem auf Excel basierenden Tool SOTEA (Software Tool für effiziente Antriebe) lässt sich mit wenigen betrieblichen Kenndaten und den Stromkosten das Potenzial zur Energieeinsparung in einem Industrie- oder Gewerbebetrieb ermitteln. Die Abschätzung mit SOTEA beim ersten Gespräch mit dem Chef ist die rasche und einfache Entscheidungsgrundlage, ob ein Motor-Check sinnvoll ist. Dieses stufenweise Vorgehen verhindert unnötigen Aufwand. Beim Design des Tools ist darauf geachtet worden, dass nur einfach erhältliche Daten eingegeben werden müssen. "}]
[]
[{"$f":"CHOOSE($F$4,Sprachen3!B46,Sprachen3!C46,Sprachen3!D46,Sprachen3!E46)","v":"Die Berechnungen basieren auf hinterlegten Referenzanlagen, auf aktuellen Preisen (für 4 polige Motoren, Frequenzumrichter und Installation) sowie auf der aktuellen Norm IEC 60034-30-1:2014"}]
[]
[{"$f":"CHOOSE($F$4,Sprachen3!B47,Sprachen3!C47,Sprachen3!D47,Sprachen3!E47)","v":"Die Bestimmung des Effizienzpotential [kWh/a], der Ersatzinvestition zur Realisierung des Effizienzpotentials [RMB] und die Payback-Zeit zur Realisierung des Effizienzpotentials [a] basiert auf folgenden Regeln:\n\n  Motoren sind eine Leistungsstufe kleiner (Rasterung gemäss Norm)\n  Bestehende Motoren werden durch IE4-Motoren ersetzt\n  über 25 jährige Motoren werden zu 80% ersetzt\n  20 jährige Motoren werden zu 60% ersetzt\n  10 jährige werden zu 40% ersetzt\n  5 jährige werden zu 20% ersetzt\n  unter 5 jährige werden zu 0% ersetzt\n  x jährige werden zu yy % ersetzt (lineare Approximation)\n  x % der ersetzten Motoren erhalten einen FU (siehe Benutzerannahmen)"}]
[]
{"$rows_left_out":28}
{"sheet":"Nutzungsbedingungen","index":4,"n_rows":16,"n_cols":6,"rows_kept":16,"cut":false,"hidden":false,"merged":[]}
[{"$f":"CHOOSE($F$4,Sprachen3!B68,Sprachen3!C68,Sprachen3!D68,Sprachen3!E68)","v":"Nutzungsbedingungen"}]
[]
[{"$f":"CHOOSE($F$4,Sprachen3!B69,Sprachen3!C69,Sprachen3!D69,Sprachen3!E69)","v":"SOTEA ist ein Programm von Topmotors und wurde vom Topmotors-Team entwickelt. Das Programm befindet sich zurzeit in der Testphase."}]
[{"$f":"CHOOSE($F$4,Sprachen3!B70,Sprachen3!C70,Sprachen3!D70,Sprachen3!E70)","v":"Sotea darf nur an dazu berechtigte Personen abgegeben werden."},null,null,null,null,1]
[{"$f":"CHOOSE($F$4,Sprachen3!B71,Sprachen3!C71,Sprachen3!D71,Sprachen3!E71)","v":"Das Copyright liegt bei S.A.F.E."}]
[{"$f":"CHOOSE($F$4,Sprachen3!B73,Sprachen3!C73,Sprachen3!D73,Sprachen3!E73)","v":"Die Genauigkeit der Ergebnisse wird im Wesentlichen von den Eingabedaten bestimmt."}]
[{"$f":"CHOOSE($F$4,Sprachen3!B74,Sprachen3!C74,Sprachen3!D74,Sprachen3!E74)","v":"Allfällige Fehlbeurteilungen aufgrund falscher Eingaben oder Rechnungsfehler des Tools sind möglich. Deshalb müssen Ergebnisse, welche weitergehende Konsequenzen (z.B. Investitionen) nach sich ziehen, zwingend von unabhängigen Experten verifiziert werden."}]
[]
[{"$f":"CHOOSE($F$4,Sprachen3!B72,Sprachen3!C72,Sprachen3!D72,Sprachen3!E72)","v":"Haftung"}]
[]
{"$rows_left_out":7}
{"sheet":"Konstanten Motoren","index":5,"n_rows":70,"n_cols":13,"rows_kept":70,"cut":false,"hidden":false,"merged":[]}
[{"$f":"CHOOSE($M$4,Sprachen3!B82,Sprachen3!C82,Sprachen3!D82,Sprachen3!E82)","v":"Konstanten Motoren"}]
[]
[{"$f":"CHOOSE($M$4,Sprachen3!B83,Sprachen3!C83,Sprachen3!D83,Sprachen3!E83)","v":"Lastfaktor"},null,null,{"$f":"CHOOSE($M$4,Sprachen3!B102,Sprachen3!C102,Sprachen3!D102,Sprachen3!E102)","v":"Lebenszyklus"},null,null,"FU-Verbesserungsfaktor*",null,null,{"$f":"CHOOSE($M$4,Sprachen3!B104,Sprachen3!C104,Sprachen3!D104,Sprachen3!E104)","v":"Teillast-Abminderungsfaktor*"}]
[{"$f":"CHOOSE($M$4,Sprachen3!B84,Sprachen3!C84,Sprachen3!D84,Sprachen3!E84)","v":"Nennleistung [kW]"},{"$f":"CHOOSE($M$4,Sprachen3!B85,Sprachen3!C85,Sprachen3!D85,Sprachen3!E85)","v":"Lastfaktor [%]"},null,{"$f":"CHOOSE($M$4,Sprachen3!B84,Sprachen3!C84,Sprachen3!D84,Sprachen3!E84)","v":"Nennleistung [kW]"},{"$f":"CHOOSE($M$4,Sprachen3!B103,Sprachen3!C103,Sprachen3!D103,Sprachen3!E103)","v":"Lebenszyklus [a]"},null,"Wert","Faktor[]",null,{"$f":"CHOOSE($M$4,Sprachen3!B85,Sprachen3!C85,Sprachen3!D85,Sprachen3!E85)","v":"Lastfaktor [%]"},{"$f":"CHOOSE($M$4,Sprachen3!B105,Sprachen3!C105,Sprachen3!D105,Sprachen3!E105)","v":"Faktor []"},null,1]
[0,40,null,0,10,null,"ja",0.8,null,0,0.92]
[1,50,null,1,10,null,"nein",1,null,40,0.92]
[10,60,null,100,20,null,null,null,null,60,0.98]
[100,70,null,1000,20,null,null,null,null,80,1]
[1000,80,null,10000,20,null,null,null,null,100,1]
[10000,90]
{"$rows_left_out":61}
{"sheet":"Kosten","index":6,"n_rows":43,"n_cols":13,"rows_kept":43,"cut":false,"hidden":false,"merged":[]}
[{"$f":"CHOOSE($L$4,Sprachen3!B111,Sprachen3!C111,Sprachen3!D111,Sprachen3!E111)","v":"Kosten Motoren (IE4-Motoren)"},null,null,null,{"$f":"CHOOSE($L$4,Sprachen3!B115,Sprachen3!C115,Sprachen3!D115,Sprachen3!E115)","v":"Kosten Frequenzumrichter"},null,null,null,{"$f":"CHOOSE($L$4,Sprachen3!B116,Sprachen3!C116,Sprachen3!D116,Sprachen3!E116)","v":"Kosten Installation"}]
[]
[{"$f":"CHOOSE($L$4,Sprachen3!B112,Sprachen3!C112,Sprachen3!D112,Sprachen3!E112)","v":"mech. Nennleistung"},{"$f":"CHOOSE($L$4,Sprachen3!B113,Sprachen3!C113,Sprachen3!D113,Sprachen3!E113)","v":"spezifischer Preis"},{"$f":"CHOOSE($L$4,Sprachen3!B114,Sprachen3!C114,Sprachen3!D114,Sprachen3!E114)","v":"Kosten 4-polige Motoren"},null,{"$f":"CHOOSE($L$4,Sprachen3!B112,Sprachen3!C112,Sprachen3!D112,Sprachen3!E112)","v":"mech. Nennleistung"},{"$f":"CHOOSE($L$4,Sprachen3!B113,Sprachen3!C113,Sprachen3!D113,Sprachen3!E113)","v":"spezifischer Preis"},{"$f":"CHOOSE($L$4,Sprachen3!B115,Sprachen3!C115,Sprachen3!D115,Sprachen3!E115)","v":"Kosten Frequenzumrichter"},null,{"$f":"CHOOSE($L$4,Sprachen3!B112,Sprachen3!C112,Sprachen3!D112,Sprachen3!E112)","v":"mech. Nennleistung"},{"$f":"CHOOSE($L$4,Sprachen3!B116,Sprachen3!C116,Sprachen3!D116,Sprachen3!E116)","v":"Kosten Installation"},null,null,"EUR"]
[{"$f":"CHOOSE($L$4,Sprachen3!B160,Sprachen3!C160,Sprachen3!D160,Sprachen3!E160)","v":"[kW]"},{"$f":"CONCATENATE(\"[\",M3,\"/kW]\")","v":"[EUR/kW]"},{"$f":"CONCATENATE(\"[\",M3,\"]\")","v":"[EUR]"},null,{"$f":"CHOOSE($L$4,Sprachen3!B160,Sprachen3!C160,Sprachen3!D160,Sprachen3!E160)","v":"[kW]"},{"$f":"CONCATENATE(\"[\",M3,\"/kW]\")","v":"[EUR/kW]"},{"$f":"CONCATENATE(\"[\",M3,\"]\")","v":"[EUR]"},null,{"$f":"CHOOSE($L$4,Sprachen3!B160,Sprachen3!C160,Sprachen3!D160,Sprachen3!E160)","v":"[kW]"},{"$f":"CONCATENATE(\"[\",M3,\"]\")","v":"[EUR]"},null,1,0.82]
[0.12,{"$f":"1100*FCHFRMB","v":902},{"$f":"A5*B5","v":108.24},null,0.12,{"$f":"2000*FCHFRMB","v":1640},{"$f":"E5*F5","v":196.79999999999998},null,0.12,{"$f":"200*FCHFRMB","v":164}]
[0.18,{"$f":"804*FCHFRMB","v":659.28},{"$f":"A6*B6","v":118.67039999999999},null,0.18,{"$f":"2000*FCHFRMB","v":1640},{"$f":"E6*F6","v":295.2},null,0.18,{"$f":"260*FCHFRMB","v":213.2}]
[0.2,{"$f":"804*FCHFRMB","v":659.28},131.85599999999999,null,0.2,{"$f":"2000*FCHFRMB","v":1640},328,null,0.2,{"$f":"320*FCHFRMB","v":262.39999999999998}]
[0.25,{"$f":"593*FCHFRMB","v":486.26},121.565,null,0.25,{"$f":"2000*FCHFRMB","v":1640},410,null,0.25,{"$f":"380*FCHFRMB","v":311.59999999999997}]
[0.37,{"$f":"391*FCHFRMB","v":320.62},118.6294,null,0.37,{"$f":"1000*FCHFRMB","v":820},303.39999999999998,null,0.37,{"$f":"440*FCHFRMB","v":360.79999999999995}]
[0.4,{"$f":"391*FCHFRMB","v":320.62},128.24800000000002,null,0.4,{"$f":"1000*FCHFRMB","v":820},328,null,0.4,{"$f":"500*FCHFRMB","v":410}]
{"$rows_left_out":34}
{"sheet":"Referenzanlagen","index":7,"n_rows":44,"n_cols":2,"rows_kept":44,"cut":false,"hidden":true,"merged":[]}
["Referenzanlagen mit Verteilungen und Zuordnungen (nur intern)"]
[]
["mech. Nennleistung","Motorenverteilung EASY 2014"]
[" [kW]"," [%]"]
[0.12,1.79]
[0.18,1.1599999999999999]
[0.2,0.39]
[0.25,0.72]
[0.37,2.41]
[0.4,1.23]
{"$rows_left_out":35}
{"sheet":"BerechnungenAnlagen ","index":8,"n_rows":45,"n_cols":15,"rows_kept":45,"cut":false,"hidden":true,"merged":[]}
["Berechnungen Anlagen",null,8760,24]
[]
["mech. Nennleistung","Anzahl Motoren mit Polzahl 4","Anzahl Ersatzmotoren mit Polzahl 4","Lastfaktor effektiv","Lastfaktor optimiert","Motorwirkungsgrad effektiv","Motorwirkungsgrad optimiert","Teillast-Abminderungsfaktor effektiv","Teillast-Abminderungsfaktor optimiert",null,"Elektrizitätsverbrauch effektiv","Elektrizitätsverbrauch optimiert (IE4, Minus eine Leistungsstufe)","Ersatzinvestition Motoren bei 100% Ersatz","Ersatzinvestition FU bei 100% Ersatz","Ersatzinvestition Installation bei 100% Ersatz"]
[" [kW]"," [%]"," [%]","[%]","[%]"," []"," []"," []"," []",null,"[kWh/a]","[kWh/a]","[CHF]","[CHF]","[CHF]"]
[0.12,1.79,{"$f":"B5 + B6","v":2.95},{"$f":"ROUND(Linear(A5,'Konstanten Motoren'!$A$5:$B$10),0)","v":41},{"$f":"ROUND(Linear(A5,'Konstanten Motoren'!$A$5:$B$10),0)*A6/A5","v":61.5},{"$f":"Motorwirkungsgrad(A5,$D$1,4,\"\",\"True\")","v":0.40001875162124634},{"$f":"Motorwirkungsgrad(A5,$D$1,4,\"\",\"False\")","v":0.69846081733703613},{"$f":"ROUND(Linear(D5,'Konstanten Motoren'!$J$5:$K$9),2)","v":0.92},{"$f":"ROUND(Linear(E5,'Konstanten Motoren'!$J$5:$K$9),2)","v":0.98},null,{"$f":"A5*(D5/100)*B5*$C$1/(F5*H5)","v":2096.3030316466584},{"$f":"A5*(E5/100)*C5*$C$1/(G5*I5)","v":2786.2132964682487},{"$f":"C5*Kosten!C5","v":319.30799999999999},{"$f":"C5*Kosten!G5","v":580.55999999999995},{"$f":"C5*Kosten!J5","v":483.8}]
[0.18,1.1599999999999999,{"$f":"B7","v":0.39},{"$f":"ROUND(Linear(A6,'Konstanten Motoren'!$A$5:$B$10),0)","v":42},{"$f":"ROUND(Linear(A6,'Konstanten Motoren'!$A$5:$B$10),0)*A7/A6","v":46.666666666666671},{"$f":"Motorwirkungsgrad(A6,$D$1,4,\"\",\"True\")","v":0.48391422629356384},{"$f":"Motorwirkungsgrad(A6,$D$1,4,\"\",\"False\")","v":0.74733251333236694},{"$f":"ROUND(Linear(D6,'Konstanten Motoren'!$J$5:$K$9),2)","v":0.93},{"$f":"ROUND(Linear(E6,'Konstanten Motoren'!$J$5:$K$9),2)","v":0.94},null,{"$f":"A6*(D6/100)*B6*$C$1/(F6*H6)","v":1706.9961928219309},{"$f":"A6*(E6/100)*C6*$C$1/(G6*I6)","v":408.51336413508869},{"$f":"C6*Kosten!C6","v":46.281455999999999},{"$f":"C6*Kosten!G6","v":115.128},{"$f":"C6*Kosten!J6","v":83.147999999999996}]
[0.2,0.39,{"$f":"B8","v":0.72},{"$f":"ROUND(Linear(A7,'Konstanten Motoren'!$A$5:$B$10),0)","v":42},{"$f":"ROUND(Linear(A7,'Konstanten Motoren'!$A$5:$B$10),0)*A8/A7","v":52.5},0.50244534015655518,0.75828087329864502,{"$f":"ROUND(Linear(D7,'Konstanten Motoren'!$J$5:$K$9),2)","v":0.93},{"$f":"ROUND(Linear(E7,'Konstanten Motoren'!$J$5:$K$9),2)","v":0.96},null,614.15250546453535,909.75524280210357,{"$f":"C7*Kosten!C7","v":94.936319999999995},{"$f":"C7*Kosten!G7","v":236.16},{"$f":"C7*Kosten!J7","v":188.92799999999997}]
[0.25,0.72,2.41,{"$f":"ROUND(Linear(A8,'Konstanten Motoren'!$A$5:$B$10),0)","v":43},{"$f":"ROUND(Linear(A8,'Konstanten Motoren'!$A$5:$B$10),0)*A9/A8","v":63.64},0.5381244421005249,0.77945536375045776,{"$f":"ROUND(Linear(D8,'Konstanten Motoren'!$J$5:$K$9),2)","v":0.93},{"$f":"ROUND(Linear(E8,'Konstanten Motoren'!$J$5:$K$9),2)","v":0.98},null,1354.8131388909046,4397.1775576238679,{"$f":"C8*Kosten!C8","v":292.97165000000001},{"$f":"C8*Kosten!G8","v":988.1},{"$f":"C8*Kosten!J8","v":750.95600000000002}]
[0.37,2.41,1.23,{"$f":"ROUND(Linear(A9,'Konstanten Motoren'!$A$5:$B$10),0)","v":44},{"$f":"ROUND(Linear(A9,'Konstanten Motoren'!$A$5:$B$10),0)*A10/A9","v":47.567567567567572},0.591927170753479,0.8112335205078125,{"$f":"ROUND(Linear(D9,'Konstanten Motoren'!$J$5:$K$9),2)","v":0.93},{"$f":"ROUND(Linear(E9,'Konstanten Motoren'!$J$5:$K$9),2)","v":0.94},null,6243.4455028542779,2486.8417178314803,{"$f":"C9*Kosten!C9","v":145.914162},{"$f":"C9*Kosten!G9","v":373.18199999999996},{"$f":"C9*Kosten!J9","v":443.78399999999993}]
[0.4,1.23,2.9,{"$f":"ROUND(Linear(A10,'Konstanten Motoren'!$A$5:$B$10),0)","v":44},{"$f":"ROUND(Linear(A10,'Konstanten Motoren'!$A$5:$B$10),0)*A11/A10","v":60.500000000000007},0.60169440507888794,0.81690436601638794,{"$f":"ROUND(Linear(D10,'Konstanten Motoren'!$J$5:$K$9),2)","v":0.93},{"$f":"ROUND(Linear(E10,'Konstanten Motoren'!$J$5:$K$9),2)","v":0.98},null,3388.9328507492523,7679.2742382470979,{"$f":"C10*Kosten!C10","v":371.91920000000005},{"$f":"C10*Kosten!G10","v":951.19999999999993},{"$f":"C10*Kosten!J10","v":1189}]
{"$rows_left_out":36}
{"sheet":"InitialwerteSteuerelemente","index":9,"n_rows":15,"n_cols":1,"rows_kept":15,"cut":false,"hidden":true,"merged":[]}
["deutsch"]
["français"]
["english"]
["中文"]
[]
[]
[]
[]
[]
["Bitte wählen..."]
{"$rows_left_out":6}
{"sheet":"Sprachen1","index":10,"n_rows":124,"n_cols":5,"rows_kept":124,"cut":false,"hidden":true,"merged":[]}
["Sprachen1: Eingaben"]
[]
["Objekt-Detail","Deutsch","Französisch","Englisch","Chinesisch"]
["Excelblatt","SOTEA","SOTEA","SOTEA","SOTEA"]
["Excelblatt","Software Tool des Effizienzpotenzials bei elektrischen Antrieben","Outil logiciel du potentiel d’efficacité des entraînements électriques","Software Tool for the estimate of energy efficiency ","能效评估软件工具"]
["Excelblatt","Allgemein","Général","General","基本情况"]
["Excelblatt","deutsch/français/english/中文","deutsch/français/english/中文","deutsch/français/english/中文","deutsch/français/english/中文"]
["Excelblatt","Datum","Date","Date","日期"]
["Excelblatt","Firma","Firme","Company name","公司名称"]
["Excelblatt","Objekt","Objet","Object","目标"]
{"$rows_left_out":115}
{"sheet":"Sprachen2","index":11,"n_rows":59,"n_cols":5,"rows_kept":59,"cut":false,"hidden":true,"merged":[]}
["Sprachen2: Resultat"]
[]
["Objekt-Detail","Deutsch","Französisch","Englisch","Chinesisch"]
["Excelblatt","SOTEA Resultat","SOTEA-Résultat","SOTEA Result","SOTEA 结果"]
["Excelblatt","Eingabe-Protokoll","Procès-verbal de saisie","Input record","输入记录"]
["Excelblatt","Allgemein","Général","General","概要"]
["Excelblatt","Datum","Date","Date","日期"]
["Excelblatt","Firma","Firme","Company name","公司名称"]
["Excelblatt","Objekt","Objet","Factory name","工厂名称"]
["Excelblatt","Lieferndes EW","Entreprise d’électricité","Power utility name","电力公司名称"]
{"$rows_left_out":50}
{"sheet":"Sprachen3","index":12,"n_rows":168,"n_cols":5,"rows_kept":168,"cut":false,"hidden":true,"merged":[]}
["Sprachen3: Weiteres"]
[]
["Objekt-Detail","Deutsch","Französisch","Englisch","Chinesisch"]
["Texte Benutzerannahmen","Benutzerannahmen","Hypothèses de l'utilisateur","Special factory data","工厂数据"]
[null,"Konstanten","Constantes","Constants","常数"]
[null,"Konstante","Constante","Constant ","常数"]
[null,"Elektrischer Energieverbrauch Büroarbeitsplatz pro Mitarbeiter [kWh/a] ","Consommation d'énergie électrique de places de travail par d'emplois de bureau [kWh/a] ","Electric energy use per office workplace and per employee  [kWh/a] ","办公室平均用电量和人均用电量 [度/年]"]
[null,"Elektrischer Energieverbrauch Beleuchtung pro Mitarbeiter [kWh/a] ","Consommation d'énergie électrique de l'éclairage par d'emplois de bureau [kWh/a] ","Electric energy use for lighting per employee [kWh/a]","人均照明用电量[度/年】"]
[null,"Anteil Spezialverbraucher am Gesamtverbrauch","Part de consommateurs spéciaux sur la consommation totale","Fraction of special users of total consumption","特殊用能部门用电百分比"]
[null,"Spezialverbraucher","Consommateurs spéciaux","Special users","特殊用能部门"]
{"$rows_left_out":158}